Home » Search

About Eclipse

71-80 of 200Refresh
Forum
7

ClassCastException: cannot be cast to com.objectdb.spi.TrackableUserType

.TherapeauticDrugScreenRqstWizard.performFinish(TherapeauticDrugScreenRqstWizard.java:170) at org.eclipse.jface.wizard.WizardDialog.finishPressed(WizardDialog.java:811) at org.eclipse.jface.wizard.WizardDialog.buttonPressed(WizardDialog.java:430) at org.eclipse.jface.dialogs.Dialog$2.widgetSelected(Dialog
Forum
7

ObectDb 2.3.6 in OSGi environment

.java:300) at org.eclipse.jdt.internal.junit4.runner.JUnit4TestReference.run(JUnit4TestReference.java:50) at org.eclipse.jdt.internal.junit.runner.TestExecution.run(TestExecution.java:38) at org.eclipse.jdt.internal.junit.runner.RemoteTestRunner.runTests(RemoteTestRunner.java:467) at org.eclipse
Forum
6

Entity with java.util.Date column gives ClassCastException in BIRT

Copied a straightforward entity class from my coleague. Using Eclipse Kepler (Reporting) and stored ... ;     } } Exception on previewing query results: org.eclipse.birt.data.engine.odaconsumer.OdaDataException: Cannot get the timestamp value column: 3.     org.eclipse.datatools.connectivity.oda.OdaException
Issue
6

[ObjectDB 2.6.0_04] Unexpected exception (Error 990) com.objectdb.jpa.JpaQuery.getResultList

) at java.lang.reflect.Method.invoke(Unknown Source) at org.eclipse.e4.core.internal.di.MethodRequestor.execute(MethodRequestor.java:55) at org.eclipse.e4.core.internal.di.InjectorImpl.invokeUsingClass(InjectorImpl.java:247) at org.eclipse.e4.core.internal.di.InjectorImpl.invoke
Forum
5

Error happened while running report.

occurred at preview result time. Like: org.eclipse.birt.report.engine.api.EngineException: Error happened while running the report. at org.eclipse.birt.report.engine.api.impl.DatasetPreviewTask.doRun(DatasetPreviewTask.java:330) at org.eclipse.birt.report.engine.api.impl.DatasetPreviewTask
Forum
5

Felix, rollback exception, error 613

.servlet.http.HttpServlet.service(HttpServlet.java:725)     at org.eclipse.jetty.servlet.ServletHolder.handle(ServletHolder.java:848)     at org.eclipse.jetty.servlet.ServletHandler.doHandle(ServletHandler.java:584)     at org.eclipse.jetty.server.session.SessionHandler.doHandle(SessionHandler.java:224
Issue
4

Internal error

.GenericServlet.init(GenericServlet.java:244) at org.eclipse.jetty.servlet.ServletHolder.initServlet(ServletHolder.java:637) at org.eclipse.jetty.servlet.ServletHolder.initialize(ServletHolder.java:421) at org.eclipse.jetty.servlet.ServletHandler.initialize(ServletHandler.java:760) at org.eclipse.jetty
Issue
4

NullPointer when accessing persistent field

.one.tests.SimulatorTestSuite$1.run(SimulatorTestSuite.java:60) at org.eclipse.jdt.internal.junit.runner.junit3.JUnit3TestReference.run(JUnit3TestReference.java:130) at org.eclipse.jdt.internal.junit.runner.TestExecution.run(TestExecution.java:38) at org.eclipse.jdt.internal.junit.runner
Forum
4

New to Product & Having An Issue

.ParentRunner.run(ParentRunner.java:220) at org.eclipse.jdt.internal.junit4.runner.JUnit4TestReference.run(JUnit4TestReference.java:46) at org.eclipse.jdt.internal.junit.runner.TestExecution.run(TestExecution.java:38) at org.eclipse.jdt.internal.junit.runner.RemoteTestRunner.runTests
Forum
4

Upgrade to 2.4.1_01

.junit.runners.ParentRunner.run(ParentRunner.java:236) at org.eclipse.jdt.internal.junit4.runner.JUnit4TestReference.run(JUnit4TestReference.java:50) at org.eclipse.jdt.internal.junit.runner.TestExecution.run(TestExecution.java:38) at org.eclipse.jdt.internal.junit.runner.RemoteTestRunner.runTests